filosofia politica
type: Concept
in scheme: subject-disciplines
notation: 025.001
editorial note: Fonte: Decreto Ministeriale 4 ottobre 2000 [In rete] http://attiministeriali.miur.it/anno-2000/ottobre/dm-04102000.aspx (26 febbraio 2018)
related match: http://thes.bncf.firenze.sbn.it/termine.php
has rank order: 2
broader: https://w3id.org/italia/controlled-vocabulary/classifications-for-culture/subject-disciplines/025
preferred label: political philosophy @en
related match: filosofia politica
definition: Il settore ha come oggetto lo studio e la riflessione sulle problematiche politiche in una prospettiva eminentemente teorica e non empirica. Il settore si articola nell'analisi filosofica del pensiero politico, nell'analisi del linguaggio politico e della simbolica politica, nella filosofia delle scienze sociali e nella storia della speculazione filosofica politica.