storia delle dottrine politiche
type: Concept
broader: https://w3id.org/italia/controlled-vocabulary/classifications-for-culture/subject-disciplines/025
notation: 025.002
editorial note: Fonte: Decreto Ministeriale 4 ottobre 2000 [In rete] http://attiministeriali.miur.it/anno-2000/ottobre/dm-04102000.aspx (26 febbraio 2018)
has rank order: 2
definition: Il settore ha come oggetto la ricostruzione storica e l'analisi critica di tutte quelle manifestazioni del pensiero umano che, attraverso una varietà di fonti e di generi letterari, ma prevalentemente attraverso la trattatistica e la saggistica, sotto forma di idee-guida, dottrine, teorie, filosofie, programmi, linguaggi e ideologie, esprimono riflessioni di carattere teoretico e/o pratico-propositivo in ordine ai fenomeni della vita sociale e del potere politico, nonché ai loro valori fondanti.
preferred label: history of political thought @en
in scheme: subject-disciplines