scienza politica
type: Concept
alternative label: scienza della politica
broader: 025
definition: La scienza politica ha come obiettivo lo studio e la ricerca sui diversi aspetti della realtà politica attraverso il metodo delle scienze empiriche e con una varietà di tradizioni di ricerca e approcci (rational choice, neo-istituzionalismo e altri). Il settore si compone di varie aree di ricerca e di insegnamento: la metodologia e le tecniche della ricerca politica (metodologia della scienza politica); le amministrazioni, i diversi altri sottosistemi organizzati e le politiche pubbliche (scienza dell’amministrazione, analisi delle politiche pubbliche, organizzazione e comportamento giudiziario, teoria delle organizzazioni complesse); i processi politici europei, la politica sovranazionale e internazionale (organizzazione politica europea, relazioni internazionali, studi strategici); i processi politici in prospettiva comparata (politica comparata, partiti politici e gruppi di pressione, teoria dello sviluppo politico, sistemi giudiziari comparati e, per quanto concerne il caso italiano, sistema politico italiano); i diversi livelli di governo (governo locale, politica locale); il linguaggio e la comunicazione politica (analisi del linguaggio politico e comunicazione politica); la teoria politica empirica (teoria politica).
editorial note: Fonte: Decreto Ministeriale 4 ottobre 2000 [In rete] http://attiministeriali.miur.it/anno-2000/ottobre/dm-04102000.aspx (26 febbraio 2018)
in scheme: subject-disciplines
notation: 025.004
preferred label: political science @en
related match: http://thes.bncf.firenze.sbn.it/termine.php
related match: scienze politiche
has rank order: 2