sociologia generale
type: Concept
notation: 025.007
has rank order: 2
alternative label: sociologia
related match: sociologia
editorial note: Fonte: Decreto Ministeriale 4 ottobre 2000 [In rete] http://attiministeriali.miur.it/anno-2000/ottobre/dm-04102000.aspx (26 febbraio 2018)
preferred label: general sociology @en
related match: http://thes.bncf.firenze.sbn.it/termine.php
definition: Il settore contiene una serie di campi di competenza concernenti la propedeutica teorica, storica e metodologica della ricerca sociale, i confini epistemologici della sociologia, gli strumenti teorico-metodologici e le tecniche per l’analisi delle processualità micro e macro-sociologiche. In quest’ottica si articola in varie aree che vanno dalla sociologia in generale (per le prospettive teoriche fondamentali, il linguaggio delle scienze sociali, l’ordine e il mutamento e per le categorie e le problematiche relative al rapporto teoria-ricerca empirica), alla metodologia e tecnica della ricerca sociale, alla politica sociale connessa alle diverse tipologie di welfare, ai metodi e alle tecniche del servizio sociale ai sistemi sociali comparati, all’analisi dei gruppi, della salute della scienza, dello sviluppo, della sicurezza sociale, ai metodi della pianificazione, alla storia del pensiero sociologico.
in scheme: subject-disciplines
broader: https://w3id.org/italia/controlled-vocabulary/classifications-for-culture/subject-disciplines/025