sociologia dei processi culturali e comunicativi
type: Concept
has rank order: 2
in scheme: subject-disciplines
preferred label: sociology of culture and communication @en
definition: Il settore comprende una serie di campi di competenza concernenti la lettura sociologica dei fenomeni della cultura, da quelli assiologici a quelli comunicativi e della socializzazione e formazione (anche delle risorse umane), fino all’impatto sociale dei mass media e delle tecnologie avanzate. Il settore si articola in varie aree: dalla sociologia della comunicazione alle dinamiche media/industria culturale, dall’analisi sociologica della radio-televisione e dell’informazione al settore dei nuovi media e della pubblicità, all’analisi dei processi culturali e dell’educazione, alla sociologia della famiglia e della religione.
alternative label: sociologia dei processi culturali
alternative label: sociologia dei processi comunicativi
notation: 025.008
broader: https://w3id.org/italia/controlled-vocabulary/classifications-for-culture/subject-disciplines/025
editorial note: Fonte: Decreto Ministeriale 4 ottobre 2000 [In rete] http://attiministeriali.miur.it/anno-2000/ottobre/dm-04102000.aspx (26 febbraio 2018)