sociologia dei processi economici e del lavoro
type: Concept
alternative label: sociologia dei processi del lavoro
has rank order: 2
preferred label: economic sociology and sociology of work and organisations @en
notation: 025.009
editorial note: Fonte: Decreto Ministeriale 4 ottobre 2000 [In rete] http://attiministeriali.miur.it/anno-2000/ottobre/dm-04102000.aspx (26 febbraio 2018)
definition: Il settore contiene una serie di campi di competenza concernenti il rapporto fra la società, da una parte, e il mondo della produzione dei beni e il mondo dell’industria e del lavoro, dall’altra, dalle relazioni industriali all’impatto sociale dell’economia e delle trasformazioni dovute alla produzione e alla distribuzione della ricchezza. Pertanto esso si articola in varie specializzazioni che vanno dalle relazioni industriali e la sociologia industriale, alla più ampia sociologia economica, del lavoro, all’analisi delle professioni, all’organizzazione dei servizi sociali.
in scheme: subject-disciplines
alternative label: sociologia dei processi economici
broader: https://w3id.org/italia/controlled-vocabulary/classifications-for-culture/subject-disciplines/025