sociologia dei fenomeni politici
type: Concept
editorial note: Fonte: Decreto Ministeriale 4 ottobre 2000 [In rete] http://attiministeriali.miur.it/anno-2000/ottobre/dm-04102000.aspx (26 febbraio 2018)
broader: https://w3id.org/italia/controlled-vocabulary/classifications-for-culture/subject-disciplines/025
in scheme: subject-disciplines
alternative label: sociologia politica
related match: http://thes.bncf.firenze.sbn.it/termine.php
preferred label: political sociology @en
has rank order: 2
definition: Il settore contiene una serie di campi di competenza concernenti il rapporto fra la società e il mondo delle decisioni strategiche vincolanti, dal parlamento, al governo, ai partiti politici, all’analisi del rapporto sistemi sociali-politiche pubbliche, talvolta anche in una prospettiva internazionalistica, dall’analisi socio-politica in generale allo studio sociologico dell’amministrazione, alla sociologia delle relazioni internazionali, alla comunicazione politica.
notation: 025.011