sociologia giuridica, della devianza e mutamento sociale
type: Concept
editorial note: Fonte: Decreto Ministeriale 4 ottobre 2000 [In rete] http://attiministeriali.miur.it/anno-2000/ottobre/dm-04102000.aspx (26 febbraio 2018)
in scheme: subject-disciplines
alternative label: sociologia della devianza
alternative label: sociologia giuridica
alternative label: sociologia del diritto
alternative label: sociologia del mutamento sociale
preferred label: sociology of law, deviance and social change @en
broader: https://w3id.org/italia/controlled-vocabulary/classifications-for-culture/subject-disciplines/025
definition: Il settore si articola in due campi di competenza anche storicamente distinti: quello della sociologia del diritto (comprensiva della sociologia dell’ordinamento giudiziario e dell’analisi sociologica e antropologica delle istituzioni giuridiche e della loro evoluzione ed efficacia in rapporto al mutamento sociale), e quello della criminologia focalizzata sull’analisi del comportamento che non si adegua ai comandi normativi e che, come tale, viene definito deviante. Pertanto, il settore studia in particolare il rapporto fra norme giuridiche, le loro funzioni e il mutamento sociale, nonché i rapporti fra comportamento deviante, il crimine e la società.
related match: http://thes.bncf.firenze.sbn.it/termine.php
notation: 025.012
has rank order: 2