storia e istituzioni dell'asia
type: Concept
broader: https://w3id.org/italia/controlled-vocabulary/classifications-for-culture/subject-disciplines/025
notation: 025.014
editorial note: Fonte: Decreto Ministeriale 4 ottobre 2000 [In rete] http://attiministeriali.miur.it/anno-2000/ottobre/dm-04102000.aspx (26 febbraio 2018)
has rank order: 2
definition: Il settore sviluppa lo studio e la ricerca sulla storia del continente asiatico sotto il profilo sia territoriale che culturale e delle civiltà, con particolare riguardo alle aree del mondo musulmano, di India, Cina, Giappone, Vicino, Medio ed Estremo Oriente, e con un’attenzione particolare alla storia delle istituzioni politiche, sociali e religiose.
preferred label: asian history and institutions @en
in scheme: subject-disciplines