COLTIVAZIONE DI COLTURE PERMANENTI
type: PrivateOrgActivityType
type: Concept
narrower: https://w3id.org/italia/controlled-vocabulary/classifications-for-organizations/ateco-2007/0124
narrower: https://w3id.org/italia/controlled-vocabulary/classifications-for-organizations/ateco-2007/0125
narrower: https://w3id.org/italia/controlled-vocabulary/classifications-for-organizations/ateco-2007/0126
narrower: https://w3id.org/italia/controlled-vocabulary/classifications-for-organizations/ateco-2007/0127
narrower: https://w3id.org/italia/controlled-vocabulary/classifications-for-organizations/ateco-2007/0122
narrower: https://w3id.org/italia/controlled-vocabulary/classifications-for-organizations/ateco-2007/0128
narrower: https://w3id.org/italia/controlled-vocabulary/classifications-for-organizations/ateco-2007/0121
narrower: https://w3id.org/italia/controlled-vocabulary/classifications-for-organizations/ateco-2007/0123
narrower: https://w3id.org/italia/controlled-vocabulary/classifications-for-organizations/ateco-2007/0129
has rank order: 3
definition: Questo gruppo include la coltivazione di colture permanenti, ossia di piante che durano nel terreno pià¹ di due annate agrarie, che pur morendo stagionalmente ricrescono in modo costante. àˆ inclusa la coltivazione di queste piante per la produzione di sementi.
broader: https://w3id.org/italia/controlled-vocabulary/classifications-for-organizations/ateco-2007/01
notation: 01.2
in scheme: ateco-2007