COLTIVAZIONE DI COLTURE PERMANENTI
type: PrivateOrgActivityType
type: Concept
broader: 01
definition: Questo gruppo include la coltivazione di colture permanenti, ossia di piante che durano nel terreno pià¹ di due annate agrarie, che pur morendo stagionalmente ricrescono in modo costante. àˆ inclusa la coltivazione di queste piante per la produzione di sementi.
in scheme: ateco-2007
narrower: 0124
narrower: 0125
narrower: 0126
narrower: 0127
narrower: 0122
narrower: 0128
narrower: 0121
narrower: 0123
narrower: 0129
notation: 01.2
has rank order: 3