ALLEVAMENTO DI ANIMALI
type: PrivateOrgActivityType
type: Concept
narrower: https://w3id.org/italia/controlled-vocabulary/classifications-for-organizations/ateco-2007/0143
narrower: https://w3id.org/italia/controlled-vocabulary/classifications-for-organizations/ateco-2007/0141
narrower: https://w3id.org/italia/controlled-vocabulary/classifications-for-organizations/ateco-2007/0146
narrower: https://w3id.org/italia/controlled-vocabulary/classifications-for-organizations/ateco-2007/0149
narrower: https://w3id.org/italia/controlled-vocabulary/classifications-for-organizations/ateco-2007/0144
narrower: https://w3id.org/italia/controlled-vocabulary/classifications-for-organizations/ateco-2007/0147
narrower: https://w3id.org/italia/controlled-vocabulary/classifications-for-organizations/ateco-2007/0142
narrower: https://w3id.org/italia/controlled-vocabulary/classifications-for-organizations/ateco-2007/0145
notation: 01.4
has rank order: 3
definition: Questo gruppo include l'allevamento e la riproduzione di tutti gli animali (esclusa la fauna acquatica).
broader: https://w3id.org/italia/controlled-vocabulary/classifications-for-organizations/ateco-2007/01
in scheme: ateco-2007