COLTIVAZIONI AGRICOLE E PRODUZIONE DI PRODOTTI ANIMALI, CACCIA E SERVIZI CONNESSI
type: PrivateOrgActivityType
type: Concept
narrower: https://w3id.org/italia/controlled-vocabulary/classifications-for-organizations/ateco-2007/011
narrower: https://w3id.org/italia/controlled-vocabulary/classifications-for-organizations/ateco-2007/016
narrower: https://w3id.org/italia/controlled-vocabulary/classifications-for-organizations/ateco-2007/017
narrower: https://w3id.org/italia/controlled-vocabulary/classifications-for-organizations/ateco-2007/014
narrower: https://w3id.org/italia/controlled-vocabulary/classifications-for-organizations/ateco-2007/012
narrower: https://w3id.org/italia/controlled-vocabulary/classifications-for-organizations/ateco-2007/015
narrower: https://w3id.org/italia/controlled-vocabulary/classifications-for-organizations/ateco-2007/013
broader: https://w3id.org/italia/controlled-vocabulary/classifications-for-organizations/ateco-2007/A
has rank order: 2
notation: 01
definition: Questa divisione include due attività di base, la produzione derivante da coltivazioni agricole e la produzione di prodotti animali; includendo anche le forme di agricoltura biologica, coltivazione di prodotti geneticamente modificati e l'allevamento di animali geneticamente modificati. Questa divisione include la coltivazione di colture in piena aria ed in serre. Questa divisione include le coltivazioni di colture fuori suolo, inclusa idroponica e acquaponica; l’acquaponica rappresenta un sistema produttivo che prevede la produzione combinata di prodotti agricoli e prodotti della pesca: le attività che utilizzano tale tecnica sono classificate nella divisione 01 solo se le coltivazioni agricole rappresentano il principale output dell’attività, altrimenti sono classificate nella divisione 03. Inoltre, sono incluse le attività di servizio accessorie all'agricoltura, alla caccia e alle attività a queste relative. Il gruppo 01.5 (Coltivazioni agricole associate all'allevamento di animali: attività mista) costituisce una eccezione ai principi generali adottati per l'identificazione dell'attività principale. Si ammette che un'azienda agricola possa avere una ben bilanciata produzione sia agricola che animale. In questo caso sarebbe arbitrario classificare l'azienda in una categoria o nell'altra. L'attività agricola esclude qualsiasi lavorazione successiva dei prodotti agricoli (classificata nelle divisioni 10 e 11 (Produzione di prodotti alimentari e bevande) e nella divisione 12 (Produzione di prodotti del tabacco), ad eccezione di quelle necessarie per preparare i prodotti per i mercati primari. Comunque, come eccezione alla regola generale di classificazione delle attività svolte in maniera integrata, una unità che trasforma in prevalenza i propri prodotti agricoli all'interno dell'azienda viene classificata nella 01 (Agricoltura), anche se l'output normalmente à¨ un prodotto della sezione C (Attività manifatturiere). Ne sono esempi: - la produzione di vino da uve p…
in scheme: ateco-2007