Silvicoltura ed altre attività forestali
type: PrivateOrgActivityType
broader: https://w3id.org/italia/controlled-vocabulary/classifications-for-organizations/ateco-2007/021
notation: 02.10
has rank order: 4
narrower: https://w3id.org/italia/controlled-vocabulary/classifications-for-organizations/ateco-2007/02100
definition: Nella classe sono incluse le attività che possono essere effettuate in foreste naturali o create dall'uomo.
in scheme: ateco-2007
type: Concept