Utilizzo di aree forestali
type: PrivateOrgActivityType
broader: https://w3id.org/italia/controlled-vocabulary/classifications-for-organizations/ateco-2007/022
notation: 02.20
has rank order: 4
narrower: https://w3id.org/italia/controlled-vocabulary/classifications-for-organizations/ateco-2007/02200
definition: I prodotti finali di questa attività possono prendere la forma di ceppi o legna da ardere.
in scheme: ateco-2007
type: Concept