ACQUACOLTURA
type: PrivateOrgActivityType
type: Concept
broader: 03
definition: Questo gruppo include "l'acquacoltura" (o aquafarming), ossia il processo di produzione che prevede la coltivazione o l'allevamento (inclusa la raccolta) di organismi acquatici (pesci, molluschi, crostacei, piante, coccodrilli, alligatori e anfibi) utilizzando tecniche progettate per aumentare la produzione di tali organismi, oltre la capacità naturale dell'ambiente (per esempio, nutrimento regolare e difesa dai predatori).
in scheme: ateco-2007
narrower: 0321
narrower: 0322
notation: 03.2
has rank order: 3