ESTRAZIONE DI MINERALI METALLIFERI
type: Concept
narrower: https://w3id.org/italia/controlled-vocabulary/classifications-for-organizations/ateco-2007/072
notation: 07
in scheme: ateco-2007
definition: Questa divisione include l'estrazione di minerali metalliferi, effettuata in sotterraneo o a cielo aperto, estrazioni marine eccetera. Sono comprese anche le operazioni di arricchimento dei minerali quali la frantumazione, la macinazione, il lavaggio, l'essiccazione, la sinterizzazione, la calcinazione o la lisciviazione, la separazione gravimetrica o le operazioni di flottazione.
broader: https://w3id.org/italia/controlled-vocabulary/classifications-for-organizations/ateco-2007/B
narrower: https://w3id.org/italia/controlled-vocabulary/classifications-for-organizations/ateco-2007/071
has rank order: 2
type: PrivateOrgActivityType