ALTRE ATTIVITÀ DI ESTRAZIONE DI MINERALI DA CAVE E MINIERE
type: Concept
narrower: https://w3id.org/italia/controlled-vocabulary/classifications-for-organizations/ateco-2007/081
in scheme: ateco-2007
narrower: https://w3id.org/italia/controlled-vocabulary/classifications-for-organizations/ateco-2007/089
definition: Questa divisione include non solo l'estrazione da cave e miniere, ma anche il dragaggio di depositi alluvionali, la frantumazione di rocce e l'utilizzo di paludi salmastre. I prodotti vengono utilizzati principalmente per le costruzioni (ad esempio: sabbie, pietre eccetera), la produzione di materiali (ad esempio: argilla, pietra da gesso, calcio eccetera), la produzione di prodotti chimici eccetera. Questa divisione non include la lavorazione dei minerali estratti (esclusa la frantumazione, la macinazione, il taglio, il lavaggio, l'essiccazione, la cernita e la miscelazione).
has rank order: 2
type: PrivateOrgActivityType
notation: 08
broader: https://w3id.org/italia/controlled-vocabulary/classifications-for-organizations/ateco-2007/B