Produzione di pasti e piatti preparati
type: PrivateOrgActivityType
broader: https://w3id.org/italia/controlled-vocabulary/classifications-for-organizations/ateco-2007/108
notation: 10.85
has rank order: 4
narrower: https://w3id.org/italia/controlled-vocabulary/classifications-for-organizations/ateco-2007/10850
definition: Questa classe include la produzione di pasti e piatti pronti (ossia preparati, conditi e cucinati), surgelati, confezionati sotto vuoto o in scatola. Generalmente questi piatti sono confezionati ed etichettati per la rivendita
in scheme: ateco-2007
type: Concept