INDUSTRIA DELLE BEVANDE
type: PrivateOrgActivityType
broader: https://w3id.org/italia/controlled-vocabulary/classifications-for-organizations/ateco-2007/C
notation: 11
has rank order: 2
narrower: https://w3id.org/italia/controlled-vocabulary/classifications-for-organizations/ateco-2007/110
definition: Questa divisione include la produzione di bevande alcoliche distillate, di bevande alcoliche ottenute tramite fermentazione, di birra e vino, di bevande analcoliche e acqua minerale.
in scheme: ateco-2007
type: Concept