CONFEZIONE DI ARTICOLI DI ABBIGLIAMENTO; CONFEZIONE DI ARTICOLI IN PELLE E PELLICCIA
type: PrivateOrgActivityType
in scheme: ateco-2007
definition: Questa divisione include tutti i tipi di sartoria (abiti confezionati o su misura), in qualsiasi materiale (ad esempio: pelle, tessuto, tessuti a maglia eccetera), tutti gli articoli di abbigliamento (ad esempio: indumenti esterni, biancheria per uomo, donna e bambino; indumenti da lavoro, abbigliamento da città o casual eccetera) e gli accessori. Non viene fatta distinzione tra abbigliamento per adulti e per bambini, o tra abbigliamento moderno e classico. La divisione 14 include anche il confezionamento di articoli in pelliccia. àˆ escluso il finissaggio degli articoli di abbigliamento (cfr. 13.30).
notation: 14
narrower: https://w3id.org/italia/controlled-vocabulary/classifications-for-organizations/ateco-2007/142
has rank order: 2
broader: https://w3id.org/italia/controlled-vocabulary/classifications-for-organizations/ateco-2007/C
narrower: https://w3id.org/italia/controlled-vocabulary/classifications-for-organizations/ateco-2007/143
type: Concept
narrower: https://w3id.org/italia/controlled-vocabulary/classifications-for-organizations/ateco-2007/141