PREPARAZIONE E CONCIA DEL CUOIO; FABBRICAZIONE DI ARTICOLI DA VIAGGIO, BORSE, PELLETTERIA E SELLERIA; PREPARAZIONE E TINTURA DI PELLICCE
type: Concept
type: PrivateOrgActivityType
has rank order: 3
narrower: https://w3id.org/italia/controlled-vocabulary/classifications-for-organizations/ateco-2007/1511
narrower: https://w3id.org/italia/controlled-vocabulary/classifications-for-organizations/ateco-2007/1512
definition: Questo gruppo include la fabbricazione di cuoio, pelle e pelliccia e articoli derivati
in scheme: ateco-2007
notation: 15.1
broader: https://w3id.org/italia/controlled-vocabulary/classifications-for-organizations/ateco-2007/15