STAMPA E SERVIZI CONNESSI ALLA STAMPA
type: PrivateOrgActivityType
type: Concept
narrower: https://w3id.org/italia/controlled-vocabulary/classifications-for-organizations/ateco-2007/1812
narrower: https://w3id.org/italia/controlled-vocabulary/classifications-for-organizations/ateco-2007/1813
narrower: https://w3id.org/italia/controlled-vocabulary/classifications-for-organizations/ateco-2007/1814
narrower: https://w3id.org/italia/controlled-vocabulary/classifications-for-organizations/ateco-2007/1811
notation: 18.1
broader: https://w3id.org/italia/controlled-vocabulary/classifications-for-organizations/ateco-2007/18
in scheme: ateco-2007
has rank order: 3
definition: Questo gruppo include le attività di stampa di quotidiani, libri, periodici, moduli commerciali, biglietti d'auguri e altro materiale; sono comprese anche le attività di supporto, quali la legatoria, la preparazione di lastre, di testi e di immagini. La stampa puà² essere effettuata utilizzando tecniche e materiali differenti.