Fabbricazione di altri prodotti chimici di base organici
type: PrivateOrgActivityType
broader: https://w3id.org/italia/controlled-vocabulary/classifications-for-organizations/ateco-2007/201
notation: 20.14
has rank order: 4
narrower: https://w3id.org/italia/controlled-vocabulary/classifications-for-organizations/ateco-2007/20140
definition: Questa classe include la fabbricazione di prodotti chimici utilizzando processi di base come il cracking termico e la distillazione. Il prodotto finale di tali processi consiste generalmente in elementi chimici separati o composti separati, definiti dal punto di vista chimico.
in scheme: ateco-2007
type: Concept