Fabbricazione di materie plastiche in forme primarie
type: PrivateOrgActivityType
broader: https://w3id.org/italia/controlled-vocabulary/classifications-for-organizations/ateco-2007/201
notation: 20.16
has rank order: 4
narrower: https://w3id.org/italia/controlled-vocabulary/classifications-for-organizations/ateco-2007/20160
definition: Questa classe include la fabbricazione di resine, materiali plastici ed elastomeri termoplastici non-vulcanizzabili, e la miscelatura di resine su richiesta del cliente, nonchà© la fabbricazione di resine sintetiche non personalizzate.
in scheme: ateco-2007
type: Concept