FABBRICAZIONE DI ARTICOLI IN GOMMA E MATERIE PLASTICHE
type: Concept
notation: 22
narrower: https://w3id.org/italia/controlled-vocabulary/classifications-for-organizations/ateco-2007/221
definition: Questa divisione include la fabbricazione di articoli in gomma e materie plastiche. La divisione à¨ caratterizzata dalle materie prime impiegate nel processo di fabbricazione. Tuttavia, cià² non implica che la fabbricazione di tutti i prodotti realizzati con questi materiali sia classificata in questa divisione.
type: PrivateOrgActivityType
in scheme: ateco-2007
has rank order: 2
narrower: https://w3id.org/italia/controlled-vocabulary/classifications-for-organizations/ateco-2007/222
broader: https://w3id.org/italia/controlled-vocabulary/classifications-for-organizations/ateco-2007/C