SIDERURGIA
type: PrivateOrgActivityType
type: Concept
broader: https://w3id.org/italia/controlled-vocabulary/classifications-for-organizations/ateco-2007/24
notation: 24.1
has rank order: 3
narrower: https://w3id.org/italia/controlled-vocabulary/classifications-for-organizations/ateco-2007/2410
definition: Questo gruppo comprende attività quali la riduzione diretta del minerale di ferro; la fabbricazione di ghisa grezza in forma liquida o solida; la conversione di ghisa grezza in acciaio; la fabbricazione di ferroleghe e di prodotti siderurgici.
in scheme: ateco-2007