SIDERURGIA
type: PrivateOrgActivityType
type: Concept
broader: 24
definition: Questo gruppo comprende attività quali la riduzione diretta del minerale di ferro; la fabbricazione di ghisa grezza in forma liquida o solida; la conversione di ghisa grezza in acciaio; la fabbricazione di ferroleghe e di prodotti siderurgici.
in scheme: ateco-2007
narrower: 2410
notation: 24.1
has rank order: 3