Fusione di acciaio
type: PrivateOrgActivityType
type: Concept
broader: https://w3id.org/italia/controlled-vocabulary/classifications-for-organizations/ateco-2007/245
notation: 24.52
has rank order: 4
narrower: https://w3id.org/italia/controlled-vocabulary/classifications-for-organizations/ateco-2007/24520
definition: Questa classe include le attività delle fonderie di acciaio.
in scheme: ateco-2007