FABBRICAZIONE DI ELEMENTI DA COSTRUZIONE IN METALLO
type: Concept
type: PrivateOrgActivityType
broader: 25
definition: Questo gruppo include la fabbricazione di elementi da costruzione in metallo (quali strutture metalliche o parti di costruzioni).
in scheme: ateco-2007
narrower: 2512
narrower: 2511
notation: 25.1
has rank order: 3