TRATTAMENTO E RIVESTIMENTO DEI METALLI; LAVORI DI MECCANICA GENERALE
type: Concept
type: PrivateOrgActivityType
notation: 25.6
broader: https://w3id.org/italia/controlled-vocabulary/classifications-for-organizations/ateco-2007/25
in scheme: ateco-2007
narrower: https://w3id.org/italia/controlled-vocabulary/classifications-for-organizations/ateco-2007/2561
narrower: https://w3id.org/italia/controlled-vocabulary/classifications-for-organizations/ateco-2007/2562
has rank order: 3
definition: Questo gruppo include le attività generali di lavorazione dei metalli, quali placcatura, rivestimento, incisione, alesatura, lucidatura, saldatura eccetera.