TRATTAMENTO E RIVESTIMENTO DEI METALLI; LAVORI DI MECCANICA GENERALE
type: Concept
type: PrivateOrgActivityType
broader: 25
definition: Questo gruppo include le attività generali di lavorazione dei metalli, quali placcatura, rivestimento, incisione, alesatura, lucidatura, saldatura eccetera.
in scheme: ateco-2007
narrower: 2561
narrower: 2562
notation: 25.6
has rank order: 3