FABBRICAZIONE DI ARTICOLI DI COLTELLERIA, UTENSILI E OGGETTI DI FERRAMENTA
type: Concept
narrower: https://w3id.org/italia/controlled-vocabulary/classifications-for-organizations/ateco-2007/2571
definition: Questo gruppo include la fabbricazione di articoli di coltelleria, utensili metallici ed oggetti di uso generale.
narrower: https://w3id.org/italia/controlled-vocabulary/classifications-for-organizations/ateco-2007/2572
broader: https://w3id.org/italia/controlled-vocabulary/classifications-for-organizations/ateco-2007/25
type: PrivateOrgActivityType
notation: 25.7
narrower: https://w3id.org/italia/controlled-vocabulary/classifications-for-organizations/ateco-2007/2573
in scheme: ateco-2007
has rank order: 3