FABBRICAZIONE DI ALTRI PRODOTTI IN METALLO
type: PrivateOrgActivityType
definition: Questo gruppo include la fabbricazione di vari prodotti in metallo per uso domestico e per l'industria, quali lattine e bidoni; chiodi, viti e dadi; attrezzi di fissaggio; eliche ed ancore per navi; strutture assemblate per linee ferroviarie eccetera.
notation: 25.9
has rank order: 3
narrower: https://w3id.org/italia/controlled-vocabulary/classifications-for-organizations/ateco-2007/2593
narrower: https://w3id.org/italia/controlled-vocabulary/classifications-for-organizations/ateco-2007/2592
narrower: https://w3id.org/italia/controlled-vocabulary/classifications-for-organizations/ateco-2007/2594
narrower: https://w3id.org/italia/controlled-vocabulary/classifications-for-organizations/ateco-2007/2599
type: Concept
narrower: https://w3id.org/italia/controlled-vocabulary/classifications-for-organizations/ateco-2007/2591
broader: https://w3id.org/italia/controlled-vocabulary/classifications-for-organizations/ateco-2007/25
in scheme: ateco-2007