FABBRICAZIONE DI PRODOTTI IN METALLO (ESCLUSI MACCHINARI E ATTREZZATURE)
type: Concept
type: PrivateOrgActivityType
narrower: https://w3id.org/italia/controlled-vocabulary/classifications-for-organizations/ateco-2007/253
narrower: https://w3id.org/italia/controlled-vocabulary/classifications-for-organizations/ateco-2007/251
narrower: https://w3id.org/italia/controlled-vocabulary/classifications-for-organizations/ateco-2007/259
narrower: https://w3id.org/italia/controlled-vocabulary/classifications-for-organizations/ateco-2007/256
narrower: https://w3id.org/italia/controlled-vocabulary/classifications-for-organizations/ateco-2007/254
narrower: https://w3id.org/italia/controlled-vocabulary/classifications-for-organizations/ateco-2007/252
narrower: https://w3id.org/italia/controlled-vocabulary/classifications-for-organizations/ateco-2007/257
narrower: https://w3id.org/italia/controlled-vocabulary/classifications-for-organizations/ateco-2007/255
in scheme: ateco-2007
notation: 25
broader: https://w3id.org/italia/controlled-vocabulary/classifications-for-organizations/ateco-2007/C
definition: Questa divisione include la fabbricazione di prodotti in metallo (quali parti, contenitori, strutture), generalmente con funzione statica fissa. La fabbricazione di armi e munizioni à¨ inclusa in questa divisione.
has rank order: 2