FABBRICAZIONE DI PRODOTTI IN METALLO (ESCLUSI MACCHINARI E ATTREZZATURE)
type: Concept
type: PrivateOrgActivityType
broader: C
definition: Questa divisione include la fabbricazione di prodotti in metallo (quali parti, contenitori, strutture), generalmente con funzione statica fissa. La fabbricazione di armi e munizioni à¨ inclusa in questa divisione.
in scheme: ateco-2007
narrower: 253
narrower: 251
narrower: 259
narrower: 256
narrower: 254
narrower: 252
narrower: 257
narrower: 255
notation: 25
has rank order: 2