Fabbricazione di apparecchiature per le telecomunicazioni
type: PrivateOrgActivityType
notation: 26.30
in scheme: ateco-2007
broader: https://w3id.org/italia/controlled-vocabulary/classifications-for-organizations/ateco-2007/263
narrower: https://w3id.org/italia/controlled-vocabulary/classifications-for-organizations/ateco-2007/26301
has rank order: 4
narrower: https://w3id.org/italia/controlled-vocabulary/classifications-for-organizations/ateco-2007/26302
type: Concept
definition: Questa classe include la fabbricazione di apparecchi per le comunicazioni telefoniche e la trasmissione di dati, utilizzati per consentire il trasferimento elettronico dei segnali lungo cavi o nell'aria attraverso trasmissioni radiotelevisive e comunicazione mobile.