Fabbricazione di apparecchiature per le telecomunicazioni
type: PrivateOrgActivityType
type: Concept
broader: 263
definition: Questa classe include la fabbricazione di apparecchi per le comunicazioni telefoniche e la trasmissione di dati, utilizzati per consentire il trasferimento elettronico dei segnali lungo cavi o nell'aria attraverso trasmissioni radiotelevisive e comunicazione mobile.
in scheme: ateco-2007
narrower: 26301
narrower: 26302
notation: 26.30
has rank order: 4