Fabbricazione di prodotti di elettronica di consumo audio e video
type: PrivateOrgActivityType
broader: https://w3id.org/italia/controlled-vocabulary/classifications-for-organizations/ateco-2007/264
notation: 26.40
has rank order: 4
narrower: https://w3id.org/italia/controlled-vocabulary/classifications-for-organizations/ateco-2007/26400
definition: Questa classe include la fabbricazione di apparecchiature audio e video di consumo per la casa, per autoveicoli, impianti di amplificazione del suono e per amplificazione di strumenti musicali.
in scheme: ateco-2007
type: Concept