Fabbricazione di prodotti di elettronica di consumo audio e video
type: PrivateOrgActivityType
type: Concept
broader: 264
definition: Questa classe include la fabbricazione di apparecchiature audio e video di consumo per la casa, per autoveicoli, impianti di amplificazione del suono e per amplificazione di strumenti musicali.
in scheme: ateco-2007
narrower: 26400
notation: 26.40
has rank order: 4