Fabbricazione di orologi
type: PrivateOrgActivityType
type: Concept
broader: https://w3id.org/italia/controlled-vocabulary/classifications-for-organizations/ateco-2007/265
notation: 26.52
has rank order: 4
narrower: https://w3id.org/italia/controlled-vocabulary/classifications-for-organizations/ateco-2007/26520
definition: Questa classe include la fabbricazione di orologi, strumenti di misurazione del tempo e parti di essi.
in scheme: ateco-2007