Fabbricazione di motori, generatori e trasformatori elettrici
type: PrivateOrgActivityType
broader: https://w3id.org/italia/controlled-vocabulary/classifications-for-organizations/ateco-2007/271
notation: 27.11
has rank order: 4
narrower: https://w3id.org/italia/controlled-vocabulary/classifications-for-organizations/ateco-2007/27110
definition: Questa classe include la fabbricazione di tutti i motori e trasformatori elettrici: AC, DC, e AC/DC.
in scheme: ateco-2007
type: Concept