Fabbricazione di motori, generatori e trasformatori elettrici
type: PrivateOrgActivityType
type: Concept
broader: 271
definition: Questa classe include la fabbricazione di tutti i motori e trasformatori elettrici: AC, DC, e AC/DC.
in scheme: ateco-2007
narrower: 27110
notation: 27.11
has rank order: 4