Fabbricazione di batterie di pile ed accumulatori elettrici
type: PrivateOrgActivityType
type: Concept
broader: 272
definition: Questa classe include la fabbricazione di batterie ricaricabili e non.
in scheme: ateco-2007
narrower: 27200
notation: 27.20
has rank order: 4