Fabbricazione di altre apparecchiature elettriche
type: PrivateOrgActivityType
type: Concept
broader: https://w3id.org/italia/controlled-vocabulary/classifications-for-organizations/ateco-2007/279
notation: 27.90
has rank order: 4
narrower: https://w3id.org/italia/controlled-vocabulary/classifications-for-organizations/ateco-2007/27900
definition: Questa classe include la fabbricazione di varie apparecchiature elettriche che non siano motori, generatori e trasformatori, batterie e accumulatori, cablaggi e sistemi di cablaggio, apparecchi per illuminazione o elettrodomestici
in scheme: ateco-2007