FABBRICAZIONE DI APPARECCHIATURE ELETTRICHE ED APPARECCHIATURE PER USO DOMESTICO NON ELETTRICHE
type: PrivateOrgActivityType
type: Concept
narrower: https://w3id.org/italia/controlled-vocabulary/classifications-for-organizations/ateco-2007/274
narrower: https://w3id.org/italia/controlled-vocabulary/classifications-for-organizations/ateco-2007/273
narrower: https://w3id.org/italia/controlled-vocabulary/classifications-for-organizations/ateco-2007/272
narrower: https://w3id.org/italia/controlled-vocabulary/classifications-for-organizations/ateco-2007/271
narrower: https://w3id.org/italia/controlled-vocabulary/classifications-for-organizations/ateco-2007/279
narrower: https://w3id.org/italia/controlled-vocabulary/classifications-for-organizations/ateco-2007/275
in scheme: ateco-2007
notation: 27
definition: Questa divisione include la fabbricazione di prodotti che generano, distribuiscono ed utilizzano la corrente elettrica. àˆ, inoltre, inclusa la fabbricazione di sistemi di illuminazione, apparecchi di segnalazione ed elettrodomestici.
has rank order: 2
broader: https://w3id.org/italia/controlled-vocabulary/classifications-for-organizations/ateco-2007/C