FABBRICAZIONE DI AUTOVEICOLI, RIMORCHI E SEMIRIMORCHI
type: PrivateOrgActivityType
broader: https://w3id.org/italia/controlled-vocabulary/classifications-for-organizations/ateco-2007/C
in scheme: ateco-2007
narrower: https://w3id.org/italia/controlled-vocabulary/classifications-for-organizations/ateco-2007/291
definition: Questa divisione include la fabbricazione di autoveicoli per il trasporto di passeggeri o merci. àˆ inclusa la fabbricazione di parti ed accessori, nonchà© la fabbricazione di rimorchi e semi-rimorchi. La manutenzione e la riparazione dei veicoli, prodotti in questa divisione, sono classificate nella classe 45.20.
type: Concept
has rank order: 2
narrower: https://w3id.org/italia/controlled-vocabulary/classifications-for-organizations/ateco-2007/292
narrower: https://w3id.org/italia/controlled-vocabulary/classifications-for-organizations/ateco-2007/293
notation: 29