COSTRUZIONE DI NAVI E IMBARCAZIONI
type: Concept
definition: Questo gruppo include la costruzione di navi, imbarcazioni ed altre strutture galleggianti per il trasporto e per altri scopi commerciali, nonchà© per diporto o attività sportive.
narrower: https://w3id.org/italia/controlled-vocabulary/classifications-for-organizations/ateco-2007/3012
in scheme: ateco-2007
has rank order: 3
type: PrivateOrgActivityType
notation: 30.1
broader: https://w3id.org/italia/controlled-vocabulary/classifications-for-organizations/ateco-2007/30
narrower: https://w3id.org/italia/controlled-vocabulary/classifications-for-organizations/ateco-2007/3011