FABBRICAZIONE DI MEZZI DI TRASPORTO N.C.A.
type: Concept
broader: https://w3id.org/italia/controlled-vocabulary/classifications-for-organizations/ateco-2007/30
notation: 30.9
narrower: https://w3id.org/italia/controlled-vocabulary/classifications-for-organizations/ateco-2007/3091
has rank order: 3
type: PrivateOrgActivityType
narrower: https://w3id.org/italia/controlled-vocabulary/classifications-for-organizations/ateco-2007/3099
narrower: https://w3id.org/italia/controlled-vocabulary/classifications-for-organizations/ateco-2007/3092
in scheme: ateco-2007
definition: Questo gruppo include la fabbricazione di mezzi di trasporto per uso civile e militare diversi da autoveicoli o mezzi ferroviari, imbarcazioni, attrezzatura per il trasporto aereo o spaziale e veicoli militari.