FABBRICAZIONE DI ALTRI MEZZI DI TRASPORTO
type: PrivateOrgActivityType
narrower: https://w3id.org/italia/controlled-vocabulary/classifications-for-organizations/ateco-2007/303
narrower: https://w3id.org/italia/controlled-vocabulary/classifications-for-organizations/ateco-2007/309
broader: https://w3id.org/italia/controlled-vocabulary/classifications-for-organizations/ateco-2007/C
in scheme: ateco-2007
has rank order: 2
narrower: https://w3id.org/italia/controlled-vocabulary/classifications-for-organizations/ateco-2007/301
narrower: https://w3id.org/italia/controlled-vocabulary/classifications-for-organizations/ateco-2007/302
definition: Questa divisione include la fabbricazione di mezzi di trasporto quali navi ed imbarcazioni, di materiale rotabile ferro-tranviario e locomotive, aeroplani, veicoli spaziali e di loro parti.
narrower: https://w3id.org/italia/controlled-vocabulary/classifications-for-organizations/ateco-2007/304
type: Concept
notation: 30